{"text_format":"1","workbook":"xlsx","n_sheets":20,"sheets":["Hoja1","Hoja2","INGRESO BALANCES","INDICE","DATOS COOP.","BALANCE GENERAL ","PYG","BALANCE GENERAL RES. ","PYG RESUMEN","VARIABLES","CALCULO INTERES","OBLIGACIONES CON EN PUBLICO","OBLIGACIONES FINANCIERAS","GASTOS PERSONAL","GASTOS OPERATIVOS ","PERFIL CARTERA","INDICADORES-RESULTADOS","MODELAMIENTO TASA INTERES ","PYG POR LINEA","PROYECCION CARTERA"],"not_rendered":{"charts":2,"images":1,"macros":1,"external_links":1,"defined_names":223,"comments":17,"pivot_tables":0},"unopened":[],"bounds":{"document_bytes":16777216,"sheet_cells":100000,"rows_first":2000,"rows_last":500,"rows_between":2000,"halvings":0,"cell_chars":16384,"cell_head_chars":4096},"cells_cut":0,"cells_raw":0,"read":"whole","date_system":"1900"}

{"sheet":"Hoja1","index":0,"n_rows":1629,"n_cols":5,"rows_kept":1629,"cut":false,"hidden":true,"merged":[]}
[]
[]
[]
[]
[]
[]
[]
[]
[]
["CATALOGO UNICO DE CUENTAS PARA USO DE LAS ENTIDADES DEL SISTEMA FINANCIERO ECUATORIANO"]
{"$rows_left_out":1620}
{"sheet":"Hoja2","index":1,"n_rows":5,"n_cols":7,"rows_kept":5,"cut":false,"hidden":true,"merged":[]}
[]
[]
[]
[null,"DATOS 1",null,null,null,"DATOS 2 "]
["NO. CUENTA","DESCRIPCION ","SALDO ",null,"NO. CUENTA","DESCRIPCION ","SALDO "]

{"sheet":"INGRESO BALANCES","index":2,"n_rows":1117,"n_cols":34,"rows_kept":1117,"cut":false,"hidden":false,"merged":[[0,2,0,7],[0,0,0,1],[25,12,26,13],[25,15,26,16],[14,12,15,13],[14,15,15,16],[7,12,8,17],[18,12,19,17]]}
["PEGUE LOS BALANCES SOLAMENTE EN VALORES SIN FORMATO",null,null,null,null,null,null,null,null,null,null,null,null,null,null,null,null,null,null,null,null,null,null,null,null,null,null,null,null,null,null,null,"ENERO ",1]
[null,null,null,null,null,null,null,null,null,null,null,null,null,null,null,null,null,null,null,null,null,null,null,null,null,null,null,null,null,null,null,null,"FEBRERO",{"$f":"+AH1+1","v":2}]
[null,"BALANCE DATOS 1",null,null,null,null,null,"BALANCE DATOS 2",null,null,null,null,null,null,null,null,null,null,null,null,null,null,null,null,null,null,null,null,null,null,null,null,"MARZO",{"$f":"+AH2+1","v":3}]
[null,null,null,null,null,null,null,null,null,null,null,null,null,null,null,null,null,null,null,null,null,null,null,null,null,null,null,null,null,null,null,null,"ABRIL",4]
["Copiar los balances con el formato de CUC de la SEPS ",null,null,null,null,null,"Copiar los balances con el formato de CUC de la SEPS ",null,null,null,null,null,null,null,null,null,null,null,null,null,null,null,null,null,null,null,null,null,null,null,null,null,"MAYO",5]
[null,"MES","ENERO ",null,null,null,null,"MES","FEBRERO",null,null,null,null,null,null,null,null,null,null,null,null,null,null,null,null,null,null,null,null,null,null,null,"JUNIO",6]
[1,"ACTIVO",null,null,null,null,1,"ACTIVO",null,null,null,null,null,null,null,null,null,null,null,null,null,null,null,null,null,null,null,null,null,null,null,null,"JULIO",7]
[11,"FONDOS DISPONIBLES",null,null,null,null,11,"FONDOS DISPONIBLES",null,null,null,null,{"$f":"CONCATENATE(\"CUADRE BALANCE \",\" \",C6)","v":"CUADRE BALANCE  ENERO "},null,null,null,null,null,null,null,null,null,null,null,null,null,null,null,null,null,null,null,"AGOSTO",8]
[1101,"CAJA",null,null,null,null,1101,"CAJA",null,null,null,null,null,null,null,null,null,null,null,null,null,null,null,null,null,null,null,null,null,null,null,null,"SEPTIEMBRE",9]
[110105,"EFECTIVO",null,null,null,null,110105,"EFECTIVO",null,null,null,null,"CUENTA",null,null,"CUENTA",null,null,null,null,null,null,null,null,null,null,null,null,null,null,null,null,"OCTUBRE",10]
{"$rows_left_out":1108}
{"sheet":"INDICE","index":3,"n_rows":20,"n_cols":11,"rows_kept":20,"cut":false,"hidden":false,"merged":[[1,0,1,11],[2,0,2,11]]}
[]
[]
[]
[]
[]
[]
[]
[]
[]
[]
{"$rows_left_out":11}
{"sheet":"DATOS COOP.","index":4,"n_rows":38,"n_cols":4,"rows_kept":38,"cut":false,"hidden":false,"merged":[[19,2,19,3],[18,2,18,3],[9,2,9,3],[10,2,10,3],[8,2,8,3],[11,2,11,3],[12,2,12,3],[13,2,15,2],[16,2,16,3],[17,2,17,3]]}
[]
[]
[]
[]
[]
[]
[]
[]
[null,null,"NOMBRE DE LA INSTITUCION "]
[null,null,"RUC"]
{"$rows_left_out":29}
{"sheet":"BALANCE GENERAL ","index":5,"n_rows":1111,"n_cols":13,"rows_kept":1111,"cut":false,"hidden":false,"merged":[[25,7,26,8],[25,10,26,11],[2,1,2,4],[1,1,1,4],[7,7,8,12],[14,7,15,8],[14,10,15,11],[18,7,19,12]]}
[]
[null,"BALANCE GENERAL"]
[null,{"$f":"IF(ISTEXT('DATOS COOP.'!E9),'DATOS COOP.'!E9,\"INGRESE DATOS EN LA HOJA DATOS COOP.\")","v":"INGRESE DATOS EN LA HOJA DATOS COOP."}]
[]
[1,"CODIGO","CUENTA",{"$f":"+'INGRESO BALANCES'!C6","v":"ENERO "},{"$f":"+'INGRESO BALANCES'!I6","v":"FEBRERO"}]
[2,1,"ACTIVO",{"$f":"IFERROR(VLOOKUP(B6,'INGRESO BALANCES'!A:C,3,FALSE),0)-D605","v":0},{"$f":"IFERROR(VLOOKUP(B6,'INGRESO BALANCES'!G:I,3,FALSE),0)-E605","v":0}]
[3,11,"FONDOS DISPONIBLES",{"$f":"IFERROR(VLOOKUP(B7,'INGRESO BALANCES'!A:C,3,FALSE),0)","v":0},{"$f":"IFERROR(VLOOKUP(B7,'INGRESO BALANCES'!G:I,3,FALSE),0)","v":0}]
[4,1101,"Caja",{"$f":"IFERROR(VLOOKUP(B8,'INGRESO BALANCES'!A:C,3,FALSE),0)","v":0},{"$f":"IFERROR(VLOOKUP(B8,'INGRESO BALANCES'!G:I,3,FALSE),0)","v":0},null,null,{"$f":"CONCATENATE(\"CUADRE BALANCE \",D5)","v":"CUADRE BALANCE ENERO "}]
[5,110105,"Efectivo",{"$f":"IFERROR(VLOOKUP(B9,'INGRESO BALANCES'!A:C,3,FALSE),0)","v":0},{"$f":"IFERROR(VLOOKUP(B9,'INGRESO BALANCES'!G:I,3,FALSE),0)","v":0}]
[6,110110,"Caja chica",{"$f":"IFERROR(VLOOKUP(B10,'INGRESO BALANCES'!A:C,3,FALSE),0)","v":0},{"$f":"IFERROR(VLOOKUP(B10,'INGRESO BALANCES'!G:I,3,FALSE),0)","v":0},null,null,"CUENTA",null,null,"CUENTA"]
{"$rows_left_out":1102}
{"sheet":"PYG","index":6,"n_rows":102,"n_cols":11,"rows_kept":102,"cut":false,"hidden":false,"merged":[[25,7,25,8],[26,7,26,8],[1,1,1,4],[2,1,2,4],[7,7,8,9],[18,7,19,9],[13,7,13,8],[14,7,14,8],[15,7,15,8],[24,7,24,8]]}
[]
[null,"BALANCE PERDIDAS Y GANANCIAS"]
[null,{"$f":"IF(ISTEXT('DATOS COOP.'!E9),'DATOS COOP.'!E9,\"INGRESE DATOS EN LA HOJA DATOS COOP.\")","v":"INGRESE DATOS EN LA HOJA DATOS COOP."}]
[]
[1,"CODIGO","CUENTA",{"$f":"+'BALANCE GENERAL '!D5","v":"ENERO "},{"$f":"+'BALANCE GENERAL '!E5","v":"FEBRERO"}]
[2]
[3,5,"TOTAL INGRESOS",{"$f":"IFERROR(VLOOKUP(B7,'INGRESO BALANCES'!A:C,3,FALSE),0)","v":0},{"$f":"IFERROR(VLOOKUP(B7,'INGRESO BALANCES'!G:I,3,FALSE),0)","v":0}]
[4,4,"TOTAL GASTOS ",{"$f":"IFERROR(VLOOKUP(B8,'INGRESO BALANCES'!A:C,3,FALSE),0)","v":0},{"$f":"IFERROR(VLOOKUP(B8,'INGRESO BALANCES'!G:I,3,FALSE),0)","v":0},null,null,{"$f":"CONCATENATE(\"CUADRE BALANCE \",D5)","v":"CUADRE BALANCE ENERO "}]
[5,51,"INTERESES Y DESCUENTOS GANADOS",{"$f":"IFERROR(VLOOKUP(B9,'INGRESO BALANCES'!A:C,3,FALSE),0)","v":0},{"$f":"IFERROR(VLOOKUP(B9,'INGRESO BALANCES'!G:I,3,FALSE),0)","v":0}]
[6,5101,"        Depósitos",{"$f":"IFERROR(VLOOKUP(B10,'INGRESO BALANCES'!A:C,3,FALSE),0)","v":0},{"$f":"IFERROR(VLOOKUP(B10,'INGRESO BALANCES'!G:I,3,FALSE),0)","v":0},null,null,"CUENTA"]
{"$rows_left_out":93}
{"sheet":"BALANCE GENERAL RES. ","index":7,"n_rows":76,"n_cols":5,"rows_kept":76,"cut":false,"hidden":false,"merged":[[1,1,1,4],[2,1,2,4]]}
[]
[null,"BALANCE GENERAL (RESUMEN)"]
[null,{"$f":"IF(ISTEXT('DATOS COOP.'!E9),'DATOS COOP.'!E9,\"INGRESE DATOS EN LA HOJA DATOS COOP.\")","v":"INGRESE DATOS EN LA HOJA DATOS COOP."}]
[]
[null,"CODIGO","CUENTA",{"$f":"+'BALANCE GENERAL '!D5","v":"ENERO "},{"$f":"+'BALANCE GENERAL '!E5","v":"FEBRERO"}]
[null,1,"ACTIVO",{"$f":"+D7+D8+D9+D10+D25+D26+D27+D28+D29","v":0},{"$f":"+E7+E8+E9+E10+E25+E26+E27+E28+E29","v":0}]
[null,11,"FONDOS DISPONIBLES",{"$f":"VLOOKUP(B7,'BALANCE GENERAL '!B:D,3,FALSE)","v":0},{"$f":"VLOOKUP(B7,'BALANCE GENERAL '!B:E,4,FALSE)","v":0}]
[null,12,"OPERACIONES INTERBANCARIAS",{"$f":"VLOOKUP(B8,'BALANCE GENERAL '!B:D,3,FALSE)","v":0},{"$f":"VLOOKUP(B8,'BALANCE GENERAL '!B:E,4,FALSE)","v":0}]
[null,13,"INVERSIONES",{"$f":"VLOOKUP(B9,'BALANCE GENERAL '!B:D,3,FALSE)","v":0},{"$f":"VLOOKUP(B9,'BALANCE GENERAL '!B:E,4,FALSE)","v":0}]
[null,14,"CARTERA DE CREDITOS",{"$f":"VLOOKUP(B10,'BALANCE GENERAL '!B:D,3,FALSE)","v":0},{"$f":"VLOOKUP(B10,'BALANCE GENERAL '!B:E,4,FALSE)","v":0}]
{"$rows_left_out":67}
{"sheet":"PYG RESUMEN","index":8,"n_rows":71,"n_cols":6,"rows_kept":71,"cut":false,"hidden":false,"merged":[[1,1,1,4],[2,1,2,4]]}
[]
[null,"BALANCE PERDIDAS Y GANANCIAS (RESUMEN)"]
[null,{"$f":"IF(ISTEXT('DATOS COOP.'!E9),'DATOS COOP.'!E9,\"INGRESE DATOS EN LA HOJA DATOS COOP.\")","v":"INGRESE DATOS EN LA HOJA DATOS COOP."}]
[]
[null,"CODIGO","CUENTA",{"$f":"+PYG!D5","v":"ENERO "},{"$f":"+PYG!E5","v":"FEBRERO"}]
[]
[null,5,"TOTAL INGRESOS",{"$f":"VLOOKUP(B7,PYG!B:D,3,FALSE)","v":0},{"$f":"VLOOKUP(B7,PYG!B:E,4,FALSE)","v":0}]
[null,4,"TOTAL GASTOS ",{"$f":"IFERROR(VLOOKUP(B8,'INGRESO BALANCES'!A:C,3,FALSE),0)","v":0},{"$f":"IFERROR(VLOOKUP(B8,'INGRESO BALANCES'!G:I,3,FALSE),0)","v":0}]
[null,51,"INTERESES Y DESCUENTOS GANADOS",{"$f":"VLOOKUP(B9,PYG!B:D,3,FALSE)","v":0},{"$f":"VLOOKUP(B9,PYG!B:E,4,FALSE)","v":0}]
[null,5101,"        Depósitos",{"$f":"VLOOKUP(B10,PYG!B:D,3,FALSE)","v":0},{"$f":"VLOOKUP(B10,PYG!B:E,4,FALSE)","v":0}]
{"$rows_left_out":62}
{"sheet":"VARIABLES","index":9,"n_rows":41,"n_cols":11,"rows_kept":41,"cut":false,"hidden":false,"merged":[[12,1,14,1],[1,0,1,8],[8,9,8,11],[10,9,10,11],[9,9,9,11],[11,0,11,4],[11,5,11,7]]}
[]
["DATOS "]
[]
[]
[]
[]
[null,null,"Comercial","Consumo","Vivienda","Microempresa","Educativo ","Inversión Pública","TOTAL "]
[]
["Participación de Cartera",null,{"$f":"+'CALCULO INTERES'!F24/'CALCULO INTERES'!$D$24","v":{"$error":"#DIV/0!"}},{"$f":"+'CALCULO INTERES'!G24/'CALCULO INTERES'!$D$24","v":{"$error":"#DIV/0!"}},{"$f":"+'CALCULO INTERES'!H24/'CALCULO INTERES'!$D$24","v":{"$error":"#DIV/0!"}},{"$f":"+'CALCULO INTERES'!I24/'CALCULO INTERES'!$D$24","v":{"$error":"#DIV/0!"}},{"$f":"+'CALCULO INTERES'!J24/'CALCULO INTERES'!$D$24","v":{"$error":"#DIV/0!"}},{"$f":"+'CALCULO INTERES'!K24/'CALCULO INTERES'!$D$24","v":{"$error":"#DIV/0!"}},{"$f":"SUM(C9:H9)","v":{"$error":"#DIV/0!"}},{"$f":"IF(OR(I9<1,I9>1),\"ESTE VALOR DEBE SUMAR EL 100%\",\"CORRECTO\")","v":{"$error":"#DIV/0!"}}]
["Provisión ","X PARTIC. DE CARTERA",{"$f":"IF(AND(($B$10=\"TODOS POR IGUAL \"),(C9>0)),1/COUNTIF($C$9:$F$9,\">0\"),C9)","v":{"$error":"#DIV/0!"}},{"$f":"IF(AND(($B$10=\"TODOS POR IGUAL \"),(D9>0)),1/COUNTIF($C$9:$F$9,\">0\"),D9)","v":{"$error":"#DIV/0!"}},{"$f":"IF(AND(($B$10=\"TODOS POR IGUAL \"),(E9>0)),1/COUNTIF($C$9:$F$9,\">0\"),E9)","v":{"$error":"#DIV/0!"}},{"$f":"IF(AND(($B$10=\"TODOS POR IGUAL \"),(F9>0)),1/COUNTIF($C$9:$F$9,\">0\"),F9)","v":{"$error":"#DIV/0!"}},{"$f":"IF(AND(($B$10=\"TODOS POR IGUAL \"),(G9>0)),1/COUNTIF($C$9:$F$9,\">0\"),G11)","v":{"$error":"#DIV/0!"}},{"$f":"IF(AND(($B$10=\"TODOS POR IGUAL \"),(H9>0)),1/COUNTIF($C$9:$F$9,\">0\"),H11)","v":{"$error":"#DIV/0!"}},{"$f":"SUM(C10:H10)","v":{"$error":"#DIV/0!"}},{"$f":"IF(OR(I10<1,I10>1),\"ESTE VALOR DEBE SUMAR EL 100%\",\"CORRECTO\")","v":{"$error":"#DIV/0!"}}]
{"$rows_left_out":32}
{"sheet":"CALCULO INTERES","index":10,"n_rows":68,"n_cols":13,"rows_kept":68,"cut":false,"hidden":false,"merged":[[1,0,1,11],[53,12,54,12],[2,0,2,11]]}
[]
["CALCULO DE TASA DE INTERES POR LINEA DE CREDITO "]
[{"$f":"IF(ISTEXT('DATOS COOP.'!E9),'DATOS COOP.'!E9,\"INGRESE DATOS EN LA HOJA DATOS COOP.\")","v":"INGRESE DATOS EN LA HOJA DATOS COOP."}]
[]
[null,"GASTOS OPERATIVOS ","DATO 1","DATO 2","PROMEDIO ","COMERCIAL ","CONSUMO","VIVIENDA","MICROEMPRESA","EDUCATIVO ","INVERSION PUBLICA","TOTAL "]
[45,"GASTOS OPERATIVOS  ANUALIZADOS",null,{"$f":"VLOOKUP(A6,'PYG RESUMEN'!B:E,4,FALSE)/'PYG RESUMEN'!F69*12","v":0},null,{"$f":"IF(ISNUMBER(VARIABLES!C11),+$D$6*VARIABLES!C11,VARIABLES!C16)","v":{"$error":"#DIV/0!"}},{"$f":"IF(ISNUMBER(VARIABLES!D11),+$D$6*VARIABLES!D11,VARIABLES!D16)","v":{"$error":"#DIV/0!"}},{"$f":"IF(ISNUMBER(VARIABLES!E11),+$D$6*VARIABLES!E11,VARIABLES!E16)","v":{"$error":"#DIV/0!"}},{"$f":"IF(ISNUMBER(VARIABLES!F11),+$D$6*VARIABLES!F11,VARIABLES!F16)","v":{"$error":"#DIV/0!"}},{"$f":"IF(ISNUMBER(VARIABLES!G11),+$D$6*VARIABLES!G11,VARIABLES!G16)","v":{"$error":"#DIV/0!"}},{"$f":"IF(ISNUMBER(VARIABLES!H11),+$D$6*VARIABLES!H11,VARIABLES!H16)","v":{"$error":"#DIV/0!"}},{"$f":"SUM(F6:K6)","v":{"$error":"#DIV/0!"}},{"$f":"+D6-L6","v":{"$error":"#DIV/0!"}}]
[14,"PROMEDIO CARTERA ",{"$f":"VLOOKUP(A7,'BALANCE GENERAL RES. '!B:D,3,FALSE)+C16","v":0},{"$f":"VLOOKUP(A7,'BALANCE GENERAL RES. '!B:E,4,FALSE)+D16","v":0},{"$f":"+(C7+D7)/2","v":0},{"$f":"+('BALANCE GENERAL RES. '!D11+'BALANCE GENERAL RES. '!E11)/2","v":0},{"$f":"+('BALANCE GENERAL RES. '!D12+'BALANCE GENERAL RES. '!E12)/2","v":0},{"$f":"+('BALANCE GENERAL RES. '!D13+'BALANCE GENERAL RES. '!E13)/2","v":0},{"$f":"+('BALANCE GENERAL RES. '!D14+'BALANCE GENERAL RES. '!E14)/2","v":0},{"$f":"+('BALANCE GENERAL RES. '!D15+'BALANCE GENERAL RES. '!E15)/2","v":0},{"$f":"+('BALANCE GENERAL RES. '!D16+'BALANCE GENERAL RES. '!E16)/2","v":0},{"$f":"SUM(F7:K7)","v":0}]
[null,"GASTOS OPERATIVOS ",null,null,null,{"$f":"IFERROR((F6/F7),0)","v":0},{"$f":"IFERROR((G6/G7),0)","v":0},0,0,0,0,0]
[]
[null,"COSTO DE PERDIDA"]
{"$rows_left_out":59}
{"sheet":"OBLIGACIONES CON EN PUBLICO","index":11,"n_rows":15,"n_cols":12,"rows_kept":15,"cut":false,"hidden":false,"merged":[[1,0,1,11]]}
[]
["OBLIGACIONES CON EL PUBLICO"]
[]
["SALDO SEGÚN BALANCE","SALDO SEGÚN BALANCE","COMPOSICION PASIVO","TASA PROMEDIO ",null,"Comercial","Consumo","Vivienda","Microempresa","Educativo ","Inversión Pública"]
[{"$f":"+'BALANCE GENERAL RES. '!C38","v":"Depósitos a la vista"},{"$f":"+'BALANCE GENERAL RES. '!E38","v":0},{"$f":"IFERROR((+B5/$B$11),0)","v":0},null,null,null,null,null,null,null,null,{"$f":"SUM(F5:K5)","v":0}]
[{"$f":"+'BALANCE GENERAL RES. '!C39","v":"Operaciones de reporto"},{"$f":"+'BALANCE GENERAL RES. '!E39","v":0},null,null,null,null,null,null,null,null,null,{"$f":"SUM(F6:K6)","v":0}]
[{"$f":"+'BALANCE GENERAL RES. '!C40","v":"Depósitos a plazo"},{"$f":"+'BALANCE GENERAL RES. '!E40","v":0},{"$f":"IFERROR((+B7/$B$11),0)","v":0},null,null,null,null,null,null,null,null,{"$f":"SUM(F7:K7)","v":0}]
[{"$f":"+'BALANCE GENERAL RES. '!C41","v":"Depósitos de garantía"},{"$f":"+'BALANCE GENERAL RES. '!E41","v":0},null,null,null,null,null,null,null,null,null,{"$f":"SUM(F8:K8)","v":0}]
[{"$f":"+'BALANCE GENERAL RES. '!C42","v":"Depósitos restringidos"},{"$f":"+'BALANCE GENERAL RES. '!E42","v":0},{"$f":"IFERROR((+B9/$B$11),0)","v":0},null,null,null,null,null,null,null,null,{"$f":"SUM(F9:K9)","v":0}]
[]
{"$rows_left_out":6}
{"sheet":"OBLIGACIONES FINANCIERAS","index":12,"n_rows":23,"n_cols":13,"rows_kept":23,"cut":false,"hidden":false,"merged":[[2,0,2,11]]}
[]
[]
["OBLIGACIONES FINANCIERAS "]
[]
["NUMERO ","NOMBRE FONDEADOR ","MONTO CREDITO ","TASA DE INTERES","% DE PARTICIPACION","PONDERACION","Comercial","Consumo","Vivienda","Microempresa","Educativo ","Inversión Pública"]
["Fondeador 1 ",null,null,null,{"$f":"IF(C6>0,+C6/$C$22,\"\")","v":""},{"$f":"IFERROR(+E6*D6,\"\")","v":""},null,null,null,null,null,null,{"$f":"IFERROR(SUM(G6:L6),\" \")","v":0}]
["Fondeador 2",null,null,null,"","",null,null,null,null,null,null,{"$f":"IFERROR(SUM(G7:L7),\" \")","v":0}]
["Fondeador 3",null,null,null,"","",null,null,null,null,null,null,0]
["Fondeador 4",null,null,null,"","",null,null,null,null,null,null,0]
["Fondeador 5",null,null,null,"","",null,null,null,null,null,null,0]
{"$rows_left_out":14}
{"sheet":"GASTOS PERSONAL","index":13,"n_rows":53,"n_cols":13,"rows_kept":53,"cut":false,"hidden":false,"merged":[[2,0,2,6]]}
[]
[]
["DISTRIBUCION GASTOS DE PERSONAL "]
[]
["NOMBRE DEL EMPLEADO ","CARGO ","VALOR DEL GASTO ",null,"ADMINISTRATIVO","CREDITO ","CAPTACIONES ",null,null,"ADMINISTRATIVO","CREDITO ","CAPTACIONES "]
[null,null,null,null,{"$f":"+C6*J6","v":0},{"$f":"+C6*K6","v":0},{"$f":"+C6*L6","v":0},{"$f":"SUM(E6:G6)-C6","v":0},null,null,null,null,{"$f":"SUM(J6:L6)","v":0}]
[null,null,null,null,0,0,0,0,null,null,null,null,{"$f":"SUM(J7:L7)","v":0}]
[null,null,null,null,0,0,0,0,null,null,null,null,0]
[null,null,null,null,0,0,0,0,null,null,null,null,0]
[null,null,null,null,0,0,0,0,null,null,null,null,0]
{"$rows_left_out":44}
{"sheet":"GASTOS OPERATIVOS ","index":14,"n_rows":26,"n_cols":14,"rows_kept":26,"cut":false,"hidden":false,"merged":[[3,0,3,8],[3,9,3,10],[13,2,13,3],[14,2,14,3],[15,2,15,3],[7,0,7,1],[8,0,8,1],[9,0,9,1]]}
[]
["INGRESAR VALORES SEGÚN "]
[]
["VALOR DE GASTOS OPERATIVOS ANUALIZADOS  A DISTRIBUIR ",null,null,null,null,null,null,null,null,{"$f":"+VARIABLES!F12","v":0}]
[]
[null,null,null,null,"Comercial","Consumo","Vivienda","Microempresa","Educativo ","Inversión Pública"]
[null,null,null,null,{"$f":"+VARIABLES!C9","v":{"$error":"#DIV/0!"}},{"$f":"+VARIABLES!D9","v":{"$error":"#DIV/0!"}},{"$f":"+VARIABLES!E9","v":{"$error":"#DIV/0!"}},{"$f":"+VARIABLES!F9","v":{"$error":"#DIV/0!"}},{"$f":"+VARIABLES!G9","v":{"$error":"#DIV/0!"}},{"$f":"+VARIABLES!H9","v":{"$error":"#DIV/0!"}}]
["PERSONAL ADMINISTRATIVO",null,{"$f":"+'GASTOS PERSONAL'!E53","v":0},"TODOS POR IGUAL",{"$f":"IF(AND(($D$8=\"TODOS POR IGUAL\"),E7>0),1/COUNTIF($E$7:$J$7,\">0\"),E7)","v":{"$error":"#DIV/0!"}},{"$error":"#DIV/0!"},{"$error":"#DIV/0!"},{"$error":"#DIV/0!"},{"$error":"#DIV/0!"},{"$error":"#DIV/0!"},{"$f":"SUM(E8:J8)","v":{"$error":"#DIV/0!"}},null,"ESTOS PORCENTAJES DEBEN DAR 100%"]
["PERSONAL CREDITO",null,{"$f":"+'GASTOS PERSONAL'!F53","v":0},null,0,0,0,0,0,0,{"$f":"SUM(E9:J9)","v":0},null,"ESTOS PORCENTAJES DEBEN DAR 100%"]
["PERSONAL CAPTACIONES ",null,{"$f":"+'GASTOS PERSONAL'!G53","v":0},"X PARTICIPACION DE CARTERA",{"$f":"IF(AND(($D$10=\"TODOS POR IGUAL\"),E9>0),1/COUNTIF($E$7:$J$7,\">0\"),E7)","v":{"$error":"#DIV/0!"}},{"$error":"#DIV/0!"},{"$error":"#DIV/0!"},{"$error":"#DIV/0!"},{"$error":"#DIV/0!"},{"$error":"#DIV/0!"},{"$f":"SUM(E10:J10)","v":{"$error":"#DIV/0!"}},null,"ESTOS PORCENTAJES DEBEN DAR 100%"]
{"$rows_left_out":17}
{"sheet":"PERFIL CARTERA","index":15,"n_rows":93,"n_cols":11,"rows_kept":93,"cut":false,"hidden":false,"merged":[[1,0,1,10]]}
[]
["PERFIL DE CARTERA"]
[]
[null,"CARTERA DE PRÉSTAMOS","VALOR TOTAL ",null,"Comercial","Consumo","Vivienda","Microempresa","Educativo ","Inversión Pública","TOTAL "]
[null,"Cartera de préstamos brutos (por segmentos)"]
[null,"Sector Agropecuario",null,null,10000,130000,null,150000,null,null,{"$f":"SUM(E6:J6)","v":290000}]
[null,"Sector Producción",null,null,null,null,null,null,null,null,0]
[null,"Servicios",null,null,null,null,null,null,null,null,0]
[null,"Comercio",null,null,null,null,null,null,null,null,0]
[null,"Vivienda",null,null,null,null,null,null,null,null,0]
{"$rows_left_out":84}
{"sheet":"INDICADORES-RESULTADOS","index":16,"n_rows":37,"n_cols":15,"rows_kept":37,"cut":false,"hidden":false,"merged":[[1,9,1,14],[1,0,1,5]]}
[]
["COMPARATIVO TASAS ",null,null,null,null,null,null,null,null,"INDICADORES"]
[]
["LINEA DE CARTERA","TASA CALCULADA ","TASA ACTUAL","BRECHA","TASA BANCO CENTRAL","TASA COMPETENCIA "]
[{"$f":"+'CALCULO INTERES'!F5","v":"COMERCIAL "},{"$f":"+'CALCULO INTERES'!F66","v":0},null,{"$f":"+C5-B5","v":0},0,0,null,null,null,"Rentabilidad ",null,{"$f":"+'PYG RESUMEN'!D5","v":"ENERO "},{"$f":"+'PYG RESUMEN'!E5","v":"FEBRERO"},"DATOS 1","DATOS 2"]
["CONSUMO",{"$f":"+'CALCULO INTERES'!G66","v":0},0.14680000000000001,{"$f":"+C6-B6","v":0.14680000000000001},0.16500000000000001,0.17,null,null,null,null,"RENDIMIENTO / ACTIVO - ROA",{"$f":"+'PYG RESUMEN'!D69","v":0},{"$f":"+'PYG RESUMEN'!E69","v":0},null,{"$f":"IFERROR(((+M6/((M7+L7)/2))/'PYG RESUMEN'!F69)*12,0)","v":0}]
[null,null,null,null,null,0,null,null,null,null,null,{"$f":"+'BALANCE GENERAL RES. '!D6","v":0},{"$f":"+'BALANCE GENERAL RES. '!E6","v":0}]
[{"$f":"+'CALCULO INTERES'!H5","v":"VIVIENDA"},{"$f":"+'CALCULO INTERES'!H66","v":0},null,{"$f":"+C8-B8","v":0},0,0,null,null,null,null,"RENDIMIENTO / PATRIMONIO - ROE",{"$f":"+'PYG RESUMEN'!D69","v":0},{"$f":"+'PYG RESUMEN'!E69","v":0},null,{"$f":"IFERROR((+M8/((M9+L9)/2))/'PYG RESUMEN'!F69*12,0)","v":0}]
[{"$f":"+'CALCULO INTERES'!I5","v":"MICROEMPRESA"},{"$f":"+'CALCULO INTERES'!I66","v":0},0.22500000000000001,{"$f":"+C9-B9","v":0.22500000000000001},0.22,0.28000000000000003,null,null,null,null,{"$f":"IFERROR(VLOOKUP(L5,'INGRESO BALANCES'!$AG$1:$AH$12,2,FALSE),0)","v":1},{"$f":"+'BALANCE GENERAL RES. '!D53","v":0},{"$f":"+'BALANCE GENERAL RES. '!E53","v":0}]
[null,null,null,{"$f":"+B10-C10","v":0},null,null,null,null,null,null,{"$f":"IFERROR(VLOOKUP(M5,'INGRESO BALANCES'!$AG$1:$AH$12,2,FALSE),0)","v":2}]
{"$rows_left_out":28}
{"sheet":"MODELAMIENTO TASA INTERES ","index":17,"n_rows":68,"n_cols":13,"rows_kept":68,"cut":false,"hidden":false,"merged":[[1,0,1,11],[53,12,54,12]]}
[]
["CALCULO DE TASA DE INTERES POR LINEA DE CREDITO "]
[]
[]
[null,"GASTOS OPERATIVOS ","DATO 1","DATO 2","PROMEDIO ","COMERCIAL ","CONSUMO","VIVIENDA","MICROEMPRESA","EDUCATIVO ","INVERSION PUBLICA","TOTAL "]
[45,"GASTOS OPERATIVOS  ANUALIZADOS",null,{"$f":"VLOOKUP(A6,'PYG RESUMEN'!B:E,4,FALSE)/'PYG RESUMEN'!F69*12","v":0},null,{"$f":"IF(ISNUMBER(VARIABLES!C11),+$D$6*VARIABLES!C11,VARIABLES!C16)","v":{"$error":"#DIV/0!"}},{"$f":"IF(ISNUMBER(VARIABLES!D11),+$D$6*VARIABLES!D11,VARIABLES!D16)","v":{"$error":"#DIV/0!"}},{"$f":"IF(ISNUMBER(VARIABLES!E11),+$D$6*VARIABLES!E11,VARIABLES!E16)","v":{"$error":"#DIV/0!"}},{"$f":"IF(ISNUMBER(VARIABLES!F11),+$D$6*VARIABLES!F11,VARIABLES!F16)","v":{"$error":"#DIV/0!"}},{"$f":"IF(ISNUMBER(VARIABLES!G11),+$D$6*VARIABLES!G11,VARIABLES!G16)","v":{"$error":"#DIV/0!"}},{"$f":"IF(ISNUMBER(VARIABLES!H11),+$D$6*VARIABLES!H11,VARIABLES!H16)","v":{"$error":"#DIV/0!"}},{"$f":"SUM(F6:K6)","v":{"$error":"#DIV/0!"}},{"$f":"+D6-L6","v":{"$error":"#DIV/0!"}}]
[14,"PROMEDIO CARTERA ",{"$f":"VLOOKUP(A7,'BALANCE GENERAL RES. '!B:D,3,FALSE)+C16","v":0},{"$f":"VLOOKUP(A7,'BALANCE GENERAL RES. '!B:E,4,FALSE)+D16","v":0},{"$f":"+(C7+D7)/2","v":0},{"$f":"+('BALANCE GENERAL RES. '!D11+'BALANCE GENERAL RES. '!E11)/2","v":0},{"$f":"+('BALANCE GENERAL RES. '!D12+'BALANCE GENERAL RES. '!E12)/2","v":0},{"$f":"+('BALANCE GENERAL RES. '!D13+'BALANCE GENERAL RES. '!E13)/2","v":0},{"$f":"+('BALANCE GENERAL RES. '!D14+'BALANCE GENERAL RES. '!E14)/2","v":0},{"$f":"+('BALANCE GENERAL RES. '!D15+'BALANCE GENERAL RES. '!E15)/2","v":0},{"$f":"+('BALANCE GENERAL RES. '!D16+'BALANCE GENERAL RES. '!E16)/2","v":0},{"$f":"SUM(F7:K7)","v":0}]
[null,"GASTOS OPERATIVOS ",null,null,null,{"$f":"IFERROR((F6/F7),0)","v":0},{"$f":"IFERROR((G6/G7),0)","v":0},0,0,0,0,0]
[]
[null,"COSTO DE PERDIDA"]
{"$rows_left_out":59}
{"sheet":"PYG POR LINEA","index":18,"n_rows":92,"n_cols":19,"rows_kept":92,"cut":false,"hidden":false,"merged":[[5,18,5,20],[72,7,72,8],[73,7,73,8],[74,7,74,8],[4,9,4,14],[4,18,4,20],[4,15,4,16],[78,7,78,8],[76,7,76,8],[79,7,79,8],[81,7,81,8],[1,1,1,4]]}
[]
[null,"BALANCE PERDIDAS Y GANANCIAS (RESUMEN)"]
[]
[null,null,null,null,null,null,null,null,null,"CREDITO COMERCIAL","CREDITO CONSUMO","CREDITO VIVIENDA","CREDITO MICRO","CREDITO EDUCATIVO","CREDITO INVERSION ","CAPTACIONES ","OTROS SERVICIOS ","TOTAL"]
[null,"CODIGO","CUENTA","DATOS 1","DATOS 2","GASTO MES",null,null,null,{"$f":"+'GASTOS OPERATIVOS '!C8+'GASTOS OPERATIVOS '!C9","v":0},null,null,null,null,null,{"$f":"+'GASTOS OPERATIVOS '!C10","v":0},null,{"$f":"+P5+J5","v":0},{"$f":"IF(OR(R5<1,R5>1),\"ESTE VALOR DEBE SUMAR EL 100%\",\"CORRECTO\")","v":"ESTE VALOR DEBE SUMAR EL 100%"}]
[null,null,null,null,null,null,null,null,null,{"$f":"+$J$5*VARIABLES!C9","v":{"$error":"#DIV/0!"}},{"$f":"+$J$5*VARIABLES!D9","v":{"$error":"#DIV/0!"}},{"$f":"+$J$5*VARIABLES!E9","v":{"$error":"#DIV/0!"}},{"$f":"+$J$5*VARIABLES!F9","v":{"$error":"#DIV/0!"}},{"$f":"+$J$5*VARIABLES!G9","v":{"$error":"#DIV/0!"}},{"$f":"+$J$5*VARIABLES!H9","v":{"$error":"#DIV/0!"}},{"$f":"+P5-Q6","v":-0.01},0.01,{"$f":"SUM(J6:Q6)","v":{"$error":"#DIV/0!"}},{"$f":"IF(OR(R6<1,R6>1),\"ESTE VALOR DEBE SUMAR EL 100%\",\"CORRECTO\")","v":{"$error":"#DIV/0!"}}]
[null,5,"TOTAL INGRESOS",{"$f":"+D9+D32+D40+G42+D59+D63","v":0},{"$f":"+E9+E32+E40+E42+E59+E63","v":0},{"$f":"+E7-D7","v":0}]
[null,null,null,null,null,{"$f":"+E8-D8","v":0}]
[null,51,"INTERESES Y DESCUENTOS GANADOS",{"$f":"VLOOKUP(B9,PYG!B:D,3,FALSE)","v":0},{"$f":"VLOOKUP(B9,PYG!B:E,4,FALSE)","v":0},0]
[null,5101,"        Depósitos",{"$f":"VLOOKUP(B10,PYG!B:D,3,FALSE)","v":0},{"$f":"VLOOKUP(B10,PYG!B:E,4,FALSE)","v":0},0,null,null,"PORCENTAJE ",{"$f":"IF($I10=$C$89,IF(J$6>0,($F10/(COUNTIF($J$6:$Q$6,\">0\"))),0),$F10*J$6)","v":{"$error":"#DIV/0!"}},{"$error":"#DIV/0!"},{"$error":"#DIV/0!"},{"$error":"#DIV/0!"},{"$error":"#DIV/0!"},{"$error":"#DIV/0!"},0,{"$f":"IF($I10=$C$89,IF(Q$6>0,($F10/(COUNTIF($J$6:$Q$6,\">0\"))),0),$F10*Q$6)","v":0},{"$f":"SUM(J10:Q10)","v":{"$error":"#DIV/0!"}},{"$f":"+F10-R10","v":{"$error":"#DIV/0!"}}]
{"$rows_left_out":83}
{"sheet":"PROYECCION CARTERA","index":19,"n_rows":265,"n_cols":19,"rows_kept":265,"cut":false,"hidden":false,"merged":[[14,4,14,5],[18,13,18,14],[20,13,20,14],[22,13,22,14],[14,7,14,8],[14,10,14,11],[16,4,16,5],[16,7,16,8],[16,10,16,11],[22,7,22,8],[24,4,24,5],[24,7,24,8],[24,10,24,11],[18,4,18,5],[18,7,18,8],[18,10,18,11],[20,4,20,5],[20,7,20,8],[20,10,20,11],[22,4,22,5],[22,10,22,11],[24,13,24,14],[14,16,14,17],[16,16,16,17],[18,16,18,17],[20,16,20,17],[22,16,22,17],[24,16,24,17],[14,13,14,14],[16,13,16,14]]}
[]
[]
[]
[]
[]
[]
[]
[]
["MES INICIO DATOS",null,"JULIO"]
[]
{"$rows_left_out":255}